Results for strict-options.test.sh

statusoshosh_.pyosh_.cc
pass 141310
FAIL 014
total141414
caseoshosh_.pyosh_.ccdescription
0pass pass pass strict_arith option
1pass FAIL FAIL Sourcing a script that returns at the top level
detailsdetails
2pass pass FAIL top level control flow
details
3pass pass FAIL errexit and top-level control flow
details
4pass pass pass shopt -s strict_control_flow
5pass pass pass return at top level is an error
6pass pass pass continue at top level is NOT an error
7pass pass pass break at top level is NOT an error
8pass pass FAIL empty argv WITHOUT strict_argv
details
9pass pass pass empty argv WITH strict_argv
10pass pass pass Arrays are incorrectly compared, but strict_array prevents it
11pass pass pass automatically creating arrays WITHOUT strict_array
12pass pass pass automatically creating arrays are INDEXED, not associative
13pass pass pass simple_eval_builtin
37 passed, 0 OK, 0 not implemented, 0 BUG, 5 failed, 0 timeouts, 0 cases skipped

Details on runs that didn't PASS

osh_.py1 Sourcing a script that returns at the top level

[osh_.py stdout] Expected 'one\nreturn-helper.sh\n42\ntwo\n', got 'one\n'
[osh_.py status] Expected 0, got 1
[osh_.py stderr] Found 'Traceback (most recent'

stdout:
one
stderr:
Traceback (most recent call last):
  File "/home/build/oil/bin/osh_eval.py", line 68, in <module>
    sys.exit(main(sys.argv))
  File "/home/build/oil/bin/osh_eval.py", line 36, in main
    None)
  File "/home/build/oil/core/shell_native.py", line 476, in Main
    cmd_flags=cmd_eval.IsMainProgram)
  File "/home/build/oil/core/main_loop.py", line 324, in Batch
    is_return, is_fatal = cmd_ev.ExecuteAndCatch(node, cmd_flags=cmd_flags)
  File "/home/build/oil/osh/cmd_eval.py", line 1490, in ExecuteAndCatch
    status = self._Execute(node)
  File "/home/build/oil/osh/cmd_eval.py", line 1337, in _Execute
    status, check_errexit = self._Dispatch(node, pipeline_st)
  File "/home/build/oil/osh/cmd_eval.py", line 623, in _Dispatch
    status = self._RunSimpleCommand(cmd_val, node.do_fork)
  File "/home/build/oil/osh/cmd_eval.py", line 477, in _RunSimpleCommand
    return self.shell_ex.RunSimpleCommand(cmd_val, do_fork)
  File "/home/build/oil/core/executor.py", line 193, in RunSimpleCommand
    status = self.RunBuiltin(builtin_id, cmd_val)
  File "/home/build/oil/core/executor.py", line 121, in RunBuiltin
    builtin_func = self.builtins[builtin_id]
KeyError: 2
osh_.cc1 Sourcing a script that returns at the top level

[osh_.cc stdout] Expected 'one\nreturn-helper.sh\n42\ntwo\n', got ''
[osh_.cc status] Expected 0, got -6

stdout:
stderr: 
osh_eval.opt: mycpp/mylib.h:674: V Dict<K, V>::index(K) [with K = int; V = vm::_Builtin*]: Assertion `0' failed.
osh_.cc2 top level control flow

[osh_.cc stdout] Expected 'SUBSHELL\nBREAK\nCONTINUE\nRETURN\n', got ''
[osh_.cc status] Expected 0, got -6

stdout:
stderr: 
osh_eval.opt: cpp/pylib_path_stat.h:10: bool path_stat::exists(Str*): Assertion `0' failed.
osh_.cc3 errexit and top-level control flow

[osh_.cc stdout] Expected 'SUBSHELL\n', got ''
[osh_.cc status] Expected 2, got -6

stdout:
stderr: 
osh_eval.opt: cpp/pylib_path_stat.h:10: bool path_stat::exists(Str*): Assertion `0' failed.
osh_.cc8 empty argv WITHOUT strict_argv

[osh_.cc stdout] Expected 'status=0\nVarSub\nCommandSub\nVarSub FAILED\nCommandSub FAILED\n', got ''
[osh_.cc status] Expected 0, got -6

stdout:
stderr: 
osh_eval.opt: cpp/posix.h:106: Tuple2<int, int> posix::pipe(): Assertion `0' failed.